Reaction Details
TargetRiboflavin-binding protein
LigandBDBM50362895
Substrate/Competitorn/a
Meas. Tech.ChEMBL_800332 (CHEMBL1948178)
pH7.4±n/a
Kd 5±n/a nM
Commentsextracted
Citation Plantinga, AWitte, ALi, MHHarmon, AChoi, SKBanaszak Holl, MMOrr, BGBaker, JRSinniah, K Bioanalytical Screening of Riboflavin Antagonists for Targeted Drug Delivery - A Thermodynamic and Kinetic Study. ACS Med Chem Lett2:363-367 (2011) 
 
Riboflavin-binding protein
Name:Riboflavin-binding protein
Type:PROTEIN
Mol. Mass.:27203.20
Organism:Gallus gallus
Description:ChEMBL_800332
Residue:238
BDBM50362895
NameBDBM50362895
Synonyms:Lactoflavin | RIBOFLAVIN
TypeSmall organic molecule
Emp. Form.C17H20N4O6
Mol. Mass.376.3639
SMILESCc1cc2nc3c(nc(=O)[nH]c3=O)n(C[C@H](O)[C@H](O)[C@H](O)CO)c2cc1C