Reaction Details
TargetATP-binding cassette sub-family C member 8
LigandBDBM50363012
Substrate/Competitorn/a
Meas. Tech.ChEMBL_800636 (CHEMBL1947668)
IC50 2980±n/a nM
Citation de Tullio, PServais, ACFillet, MGillotin, FSomers, FChiap, PLebrun, PPirotte, B Hydroxylated analogues of ATP-sensitive potassium channel openers belonging to the group of 6- and/or 7-substituted 3-isopropylamino-4H-1,2,4-benzothiadiazine 1,1-dioxides: toward an improvement in sulfonylurea receptor 1 selectivity and metabolism stability. J Med Chem54:8353-61 (2011) 
 
ATP-binding cassette sub-family C member 8
Name:ATP-binding cassette sub-family C member 8
Type:PROTEIN
Mol. Mass.:177210.63
Organism:Rattus norvegicus
Description:ChEMBL_800636
Residue:1582
BDBM50363012
NameBDBM50363012
Synonyms:CHEMBL1946759
TypeSmall organic molecule
Emp. Form.C11H14ClN3O4S
Mol. Mass.319.765
SMILESCOc1cc2c(cc1Cl)N=C(N[C@H](C)CO)NS2(=O)=O