Reaction Details
TargetALK tyrosine kinase receptor
LigandBDBM50363167
Substrate/Competitorn/a
Meas. Tech.ChEMBL_801233 (CHEMBL1947296)
IC50>10000±n/a nM
Citation Huber, KBrault, LFedorov, OGasser, CFilippakopoulos, PBullock, ANFabbro, DTrappe, JSchwaller, JKnapp, SBracher, F 7,8-dichloro-1-oxo-ß-carbolines as a versatile scaffold for the development of potent and selective kinase inhibitors with unusual binding modes. J Med Chem55:403-13 (2012) 
 
ALK tyrosine kinase receptor
Name:ALK tyrosine kinase receptor
Type:Protein
Mol. Mass.:176453.10
Organism:Homo sapiens (Human)
Description:Q9UM73
Residue:1620
BDBM50363167
NameBDBM50363167
Synonyms:CHEMBL1945559
TypeSmall organic molecule
Emp. Form.C17H16Cl2N4O
Mol. Mass.363.241
SMILESCn1c2c(C(C#N)C3(CCNCC3)NC2=O)c2ccc(Cl)c(Cl)c12