Reaction Details
TargetTyrosine-protein kinase Fyn
LigandBDBM50363167
Substrate/Competitorn/a
Meas. Tech.ChEMBL_801379 (CHEMBL1948109)
IC50>10000±n/a nM
Citation Huber, KBrault, LFedorov, OGasser, CFilippakopoulos, PBullock, ANFabbro, DTrappe, JSchwaller, JKnapp, SBracher, F 7,8-dichloro-1-oxo-ß-carbolines as a versatile scaffold for the development of potent and selective kinase inhibitors with unusual binding modes. J Med Chem55:403-13 (2012) 
 
Tyrosine-protein kinase Fyn
Name:Tyrosine-protein kinase Fyn
Type:Enzyme
Mol. Mass.:60762.21
Organism:Homo sapiens (Human)
Description:P06241
Residue:537
BDBM50363167
NameBDBM50363167
Synonyms:CHEMBL1945559
TypeSmall organic molecule
Emp. Form.C17H16Cl2N4O
Mol. Mass.363.241
SMILESCn1c2c(C(C#N)C3(CCNCC3)NC2=O)c2ccc(Cl)c(Cl)c12