Reaction Details
TargetCarbonic anhydrase 3
LigandBDBM50363534
Substrate/Competitorn/a
Meas. Tech.ChEMBL_801536 (CHEMBL1948550)
Ki 12710±n/a nM
Citation Ekinci, DCavdar, HDurdagi, STalaz, OSentürk, MSupuran, CT Structure-activity relationships for the interaction of 5,10-dihydroindeno[1,2-b]indole derivatives with human and bovine carbonic anhydrase isoforms I, II, III, IV and VI. Eur J Med Chem49:68-73 (2012) 
 
Carbonic anhydrase 3
Name:Carbonic anhydrase 3
Type:Enzyme
Mol. Mass.:29376.92
Organism:Bos taurus (Cattle)
Description:Q3SZX4
Residue:260
BDBM50363534
NameBDBM50363534
Synonyms:CHEMBL608978
TypeSmall organic molecule
Emp. Form.C16H11NO2
Mol. Mass.249.264
SMILESC1Oc2cc3Cc4c([nH]c5ccccc45)-c3cc2O1