Reaction Details
TargetCarbonic anhydrase 3
LigandBDBM26188
Substrate/Competitorn/a
Meas. Tech.ChEMBL_801536 (CHEMBL1948550)
Ki 3480±n/a nM
Citation Ekinci, DCavdar, HDurdagi, STalaz, OSentürk, MSupuran, CT Structure-activity relationships for the interaction of 5,10-dihydroindeno[1,2-b]indole derivatives with human and bovine carbonic anhydrase isoforms I, II, III, IV and VI. Eur J Med Chem49:68-73 (2012) 
 
Carbonic anhydrase 3
Name:Carbonic anhydrase 3
Type:Enzyme
Mol. Mass.:29376.92
Organism:Bos taurus (Cattle)
Description:Q3SZX4
Residue:260
BDBM26188
NameBDBM26188
Synonyms:α-CA inhibitor, 12 1,2-dihydroxybenzene benzene-1,2-diol | phenol derivative, 2
TypeSmall organic molecule
Emp. Form.C6H6O2
Mol. Mass.110.1106
SMILESOc1ccccc1O