Reaction Details
TargetCarbonic anhydrase 1
LigandBDBM50363542
Substrate/Competitorn/a
Meas. Tech.ChEMBL_801532 (CHEMBL1948546)
Ki 2470±n/a nM
Citation Ekinci, DCavdar, HDurdagi, STalaz, OSentürk, MSupuran, CT Structure-activity relationships for the interaction of 5,10-dihydroindeno[1,2-b]indole derivatives with human and bovine carbonic anhydrase isoforms I, II, III, IV and VI. Eur J Med Chem49:68-73 (2012) 
 
Carbonic anhydrase 1
Name:Carbonic anhydrase 1
Type:Enzyme
Mol. Mass.:28873.37
Organism:Homo sapiens (Human)
Description:P00915
Residue:261
BDBM50363542
NameBDBM50363542
Synonyms:CHEMBL596277
TypeSmall organic molecule
Emp. Form.C15H11NO2
Mol. Mass.237.2533
SMILESOc1ccc-2c(Cc3c-2[nH]c2ccccc32)c1O