Reaction Details
TargetProthrombin
LigandBDBM50138670
Substrate/Competitorn/a
Meas. Tech.ChEMBL_801833 (CHEMBL1947445)
Ki 5640±n/a nM
Citation Venkatraj, MMessagie, JJoossens, JLambeir, AMHaemers, AVan der Veken, PAugustyns, K Synthesis and evaluation of non-basic inhibitors of urokinase-type plasminogen activator (uPA). Bioorg Med Chem20:1557-68 (2012) 
 
Prothrombin
Name:Prothrombin
Type:Protein
Mol. Mass.:70029.57
Organism:Homo sapiens (Human)
Description:P00734
Residue:622
BDBM50138670
NameBDBM50138670
Synonyms:6-Carbamimidoyl-naphthalene-2-carboxylic acid phenylamide 6-carbamimidoyl-N-phenyl-2-naphthamide uPa_7
TypeSmall organic molecule
Emp. Form.C18H15N3O
Mol. Mass.289.3312
SMILESNC(=N)c1ccc2cc(ccc2c1)C(=O)Nc1ccccc1