Reaction Details
TargetGlycogen phosphorylase, muscle form
LigandBDBM50295843
Substrate/Competitorn/a
Meas. Tech.ChEMBL_802298 (CHEMBL1949456)
pH6.8±n/a
Ki 2300±n/a nM
Commentsextracted
Citation Nagy, VFelföldi, NKónya, BPraly, JPDocsa, TGergely, PChrysina, EDTiraidis, CKosmopoulou, MNAlexacou, KMKonstantakaki, MLeonidas, DDZographos, SEOikonomakos, NGKozmon, STvaroška, ISomsák, L N-(4-Substituted-benzoyl)-N'-(ß-d-glucopyranosyl)ureas as inhibitors of glycogen phosphorylase: Synthesis and evaluation by kinetic, crystallographic, and molecular modelling methods. Bioorg Med Chem20:1801-16 (2012) 
 
Glycogen phosphorylase, muscle form
Name:Glycogen phosphorylase, muscle form
Type:Enzyme
Mol. Mass.:97296.32
Organism:Oryctolagus cuniculus (rabbit)
Description:Phosphorylation of Ser-15 converts phosphorylase B (unphosphorylated) to phosphorylase A.
Residue:843
BDBM50295843
NameBDBM50295843
Synonyms:4-methyl-N-((2R,3R,4S,5S,6R)-3,4,5-trihydroxy-6-(hydroxymethyl)tetrahydro-2H-pyran-2-ylcarbamoyl)benzamide N-{[(4-methylphenyl)carbonyl]carbamoyl}-beta-D-glucopyranosylamine
TypeSmall organic molecule
Emp. Form.C15H20N2O7
Mol. Mass.340.3285
SMILESCc1ccc(cc1)C(=O)NC(=O)N[C@@H]1O[C@H](CO)[C@@H](O)[C@H](O)[C@H]1O