Reaction Details
TargetcGMP-inhibited 3',5'-cyclic phosphodiesterase 3A
LigandBDBM50363906
Substrate/Competitorn/a
Meas. Tech.ChEMBL_802317 (CHEMBL1949475)
IC50 1450±n/a nM
Citation Ochiai, KTakita, SEiraku, TKojima, AIwase, KKishi, TFukuchi, KYasue, TAdams, DRAllcock, RWJiang, ZKohno, Y Phosphodiesterase inhibitors. Part 3: Design, synthesis and structure-activity relationships of dual PDE3/4-inhibitory fused bicyclic heteroaromatic-dihydropyridazinones with anti-inflammatory and bronchodilatory activity. Bioorg Med Chem20:1644-58 (2012) 
 
cGMP-inhibited 3',5'-cyclic phosphodiesterase 3A
Name:cGMP-inhibited 3',5'-cyclic phosphodiesterase 3A
Type:Enzyme
Mol. Mass.:124966.46
Organism:Homo sapiens (Human)
Description:Q14432
Residue:1141
BDBM50363906
NameBDBM50363906
Synonyms:CHEMBL1946747
TypeSmall organic molecule
Emp. Form.C14H13F3N4O2
Mol. Mass.326.2738
SMILESCOc1ccc(C2=NNC(=O)CC2C)n2cc(nc12)C(F)(F)F