Reaction Details
TargetProstaglandin D2 receptor 2
LigandBDBM50363917
Substrate/Competitorn/a
Meas. Tech.ChEMBL_805475 (CHEMBL1955368)
IC50 4±n/a nM
Citation Liu, JLi, ARWang, YJohnson, MGSu, YShen, WWang, XLively, SBrown, MLai, SGonzalez Lopez De Turiso, FXu, QVan Lengerich, BSchmitt, MFu, ZSun, YLawlis, SSeitz, LDanao, JWait, JYe, QTang, HLGrillo, MCollins, TLSullivan, TJMedina, JC Discovery of AMG 853, a CRTH2 and DP Dual Antagonist. ACS Med Chem Lett2:326-330 (2011) 
 
Prostaglandin D2 receptor 2
Name:Prostaglandin D2 receptor 2
Type:Enzyme
Mol. Mass.:43295.45
Organism:Homo sapiens (Human)
Description:Q9Y5Y4
Residue:395
BDBM50363917
NameBDBM50363917
Synonyms:CHEMBL1951566
TypeSmall organic molecule
Emp. Form.C25H22Cl2F2N2O6S
Mol. Mass.587.42
SMILESCCCCNC(=O)c1ccc(Oc2cc(F)c(CC(O)=O)cc2F)c(NS(=O)(=O)c2ccc(Cl)cc2Cl)c1