Reaction Details
TargetProstaglandin D2 receptor
LigandBDBM50363926
Substrate/Competitorn/a
Meas. Tech.ChEMBL_805477 (CHEMBL1955370)
IC50 10±n/a nM
Citation Liu, JLi, ARWang, YJohnson, MGSu, YShen, WWang, XLively, SBrown, MLai, SGonzalez Lopez De Turiso, FXu, QVan Lengerich, BSchmitt, MFu, ZSun, YLawlis, SSeitz, LDanao, JWait, JYe, QTang, HLGrillo, MCollins, TLSullivan, TJMedina, JC Discovery of AMG 853, a CRTH2 and DP Dual Antagonist. ACS Med Chem Lett2:326-330 (2011) 
 
Prostaglandin D2 receptor
Name:Prostaglandin D2 receptor
Type:Enzyme
Mol. Mass.:40288.87
Organism:Homo sapiens (Human)
Description:Q13258
Residue:359
BDBM50363926
NameBDBM50363926
Synonyms:CHEMBL1951573
TypeSmall organic molecule
Emp. Form.C26H20Cl2F4N2O7S
Mol. Mass.651.411
SMILESOC(=O)Cc1cc(Cl)c(Oc2ccc(cc2NS(=O)(=O)c2ccc(OC(F)(F)F)cc2Cl)C(=O)NC2CCC2)cc1F