Reaction Details
TargetProstaglandin D2 receptor 2
LigandBDBM50363919
Substrate/Competitorn/a
Meas. Tech.ChEMBL_805476 (CHEMBL1955369)
IC50 12±n/a nM
Citation Liu, JLi, ARWang, YJohnson, MGSu, YShen, WWang, XLively, SBrown, MLai, SGonzalez Lopez De Turiso, FXu, QVan Lengerich, BSchmitt, MFu, ZSun, YLawlis, SSeitz, LDanao, JWait, JYe, QTang, HLGrillo, MCollins, TLSullivan, TJMedina, JC Discovery of AMG 853, a CRTH2 and DP Dual Antagonist. ACS Med Chem Lett2:326-330 (2011) 
 
Prostaglandin D2 receptor 2
Name:Prostaglandin D2 receptor 2
Type:Enzyme
Mol. Mass.:43295.45
Organism:Homo sapiens (Human)
Description:Q9Y5Y4
Residue:395
BDBM50363919
NameBDBM50363919
Synonyms:CHEMBL1951402
TypeSmall organic molecule
Emp. Form.C25H22Cl2N2O6S
Mol. Mass.549.423
SMILESOC(=O)Cc1ccc(Oc2ccc(cc2NS(=O)(=O)c2ccc(Cl)cc2)C(=O)NC2CCC2)c(Cl)c1