Reaction Details
TargetProstaglandin D2 receptor
LigandBDBM50363924
Substrate/Competitorn/a
Meas. Tech.ChEMBL_805477 (CHEMBL1955370)
IC50 22±n/a nM
Citation Liu, JLi, ARWang, YJohnson, MGSu, YShen, WWang, XLively, SBrown, MLai, SGonzalez Lopez De Turiso, FXu, QVan Lengerich, BSchmitt, MFu, ZSun, YLawlis, SSeitz, LDanao, JWait, JYe, QTang, HLGrillo, MCollins, TLSullivan, TJMedina, JC Discovery of AMG 853, a CRTH2 and DP Dual Antagonist. ACS Med Chem Lett2:326-330 (2011) 
 
Prostaglandin D2 receptor
Name:Prostaglandin D2 receptor
Type:Enzyme
Mol. Mass.:40288.87
Organism:Homo sapiens (Human)
Description:Q13258
Residue:359
BDBM50363924
NameBDBM50363924
Synonyms:CHEMBL1951571
TypeSmall organic molecule
Emp. Form.C26H20ClF5N2O6S
Mol. Mass.618.957
SMILESOC(=O)Cc1cc(F)c(Oc2ccc(cc2NS(=O)(=O)c2ccc(cc2Cl)C(F)(F)F)C(=O)NC2CCC2)cc1F