Reaction Details
TargetProstaglandin D2 receptor
LigandBDBM50363928
Substrate/Competitorn/a
Meas. Tech.ChEMBL_805477 (CHEMBL1955370)
IC50 35±n/a nM
Citation Liu, JLi, ARWang, YJohnson, MGSu, YShen, WWang, XLively, SBrown, MLai, SGonzalez Lopez De Turiso, FXu, QVan Lengerich, BSchmitt, MFu, ZSun, YLawlis, SSeitz, LDanao, JWait, JYe, QTang, HLGrillo, MCollins, TLSullivan, TJMedina, JC Discovery of AMG 853, a CRTH2 and DP Dual Antagonist. ACS Med Chem Lett2:326-330 (2011) 
 
Prostaglandin D2 receptor
Name:Prostaglandin D2 receptor
Type:Enzyme
Mol. Mass.:40288.87
Organism:Homo sapiens (Human)
Description:Q13258
Residue:359
BDBM50363928
NameBDBM50363928
Synonyms:CHEMBL1951575
TypeSmall organic molecule
Emp. Form.C28H27Cl2FN2O6S
Mol. Mass.609.493
SMILESCC(C)(C)NC(=O)c1ccc(Oc2cc(F)c(CC(O)=O)cc2Cl)c(NS(=O)(=O)c2ccc(cc2Cl)C2CC2)c1