Reaction Details
TargetSphingosine 1-phosphate receptor 1
LigandBDBM23165
Substrate/Competitorn/a
Meas. Tech.ChEMBL_802535 (CHEMBL1952571)
EC50 0.29±n/a nM
Citation Nishi, TMiyazaki, STakemoto, TSuzuki, KIio, YNakajima, KOhnuki, TKawase, YNara, FInaba, SIzumi, TYuita, HOshima, KDoi, HInoue, RTomisato, WKagari, TShimozato, T Discovery of CS-0777: A Potent, Selective, and Orally Active S1P1 Agonist. ACS Med Chem Lett2:368-372 (2011) 
 
Sphingosine 1-phosphate receptor 1
Name:Sphingosine 1-phosphate receptor 1
Type:PROTEIN
Mol. Mass.:42770.88
Organism:Rattus norvegicus
Description:ChEMBL_1463793
Residue:383
BDBM23165
NameBDBM23165
Synonyms:CHEMBL366208 [(2S)-2-amino-3-hydroxy-2-[2-(4-octylphenyl)ethyl]propoxy]phosphonic acid
TypeSmall organic molecule
Emp. Form.C19H34NO5P
Mol. Mass.387.4507
SMILESCCCCCCCCc1ccc(CC[C@](N)(CO)COP(O)(O)=O)cc1