Reaction Details
TargetD(1B) dopamine receptor
LigandBDBM50363967
Substrate/Competitorn/a
Meas. Tech.ChEMBL_803949 (CHEMBL1954780)
Ki 91.4±n/a nM
Citation Robaa, DEnzensperger, CEldin Abulazm, SHefnawy, MMEl-Subbagh, HIWani, TALehmann, J Chiral indolo[3,2-f][3]benzazecine-type dopamine receptor antagonists: synthesis and activity of racemic and enantiopure derivatives. J Med Chem54:7422-6 (2011) 
 
D(1B) dopamine receptor
Name:D(1B) dopamine receptor
Type:Protein
Mol. Mass.:52943.41
Organism:Homo sapiens (Human)
Description:P21918
Residue:477
BDBM50363967
NameBDBM50363967
Synonyms:CHEMBL1949729
TypeSmall organic molecule
Emp. Form.C21H24N2O
Mol. Mass.320.4281
SMILESCN1CCc2ccccc2Cc2[nH]c3ccccc3c2C[C@H]1CO