Reaction Details
TargetC-X-C chemokine receptor type 4
LigandBDBM50363984
Substrate/Competitorn/a
Meas. Tech.ChEMBL_803952 (CHEMBL1954783)
IC50 2±n/a nM
Citation Demmer, ODijkgraaf, ISchumacher, UMarinelli, LCosconati, SGourni, EWester, HJKessler, H Design, synthesis, and functionalization of dimeric peptides targeting chemokine receptor CXCR4. J Med Chem54:7648-62 (2011) 
 
C-X-C chemokine receptor type 4
Name:C-X-C chemokine receptor type 4
Type:Enzyme
Mol. Mass.:39754.61
Organism:Homo sapiens (Human)
Description:P61073
Residue:352
BDBM50363984
NameBDBM50363984
Synonyms:CHEMBL1949730
TypeSmall organic molecule
Emp. Form.C37H49N11O6
Mol. Mass.743.8551
SMILES[#6]-[#7]-1-[#6@H](-[#6]-[#6]-[#6]\[#7]=[#6](\[#7])-[#7])-[#6](=O)-[#7]-[#6@@H](-[#6]-[#6]-[#6]\[#7]=[#6](\[#7])-[#7])-[#6](=O)-[#7]-[#6@@H](-[#6]-c2ccc3ccccc3c2)-[#6](=O)-[#7]-[#6]-[#6](=O)-[#7]-[#6@H](-[#6]-c2ccc(-[#8])cc2)-[#6]-1=O