Reaction Details
TargetGlutamate receptor ionotropic, kainate 3
LigandBDBM50364074
Substrate/Competitorn/a
Meas. Tech.ChEMBL_802348 (CHEMBL1954492)
IC50 81300±n/a nM
Citation Irvine, MWCosta, BMDlaboga, DCulley, GRHulse, RScholefield, CLAtlason, PFang, GEaves, RMorley, RMayo-Martin, MBAmici, MBortolotto, ZADonaldson, LCollingridge, GLMolnár, EMonaghan, DTJane, DE Piperazine-2,3-dicarboxylic acid derivatives as dual antagonists of NMDA and GluK1-containing kainate receptors. J Med Chem55:327-41 (2012) 
 
Glutamate receptor ionotropic, kainate 3
Name:Glutamate receptor ionotropic, kainate 3
Type:Enzyme Catalytic Domain
Mol. Mass.:104046.44
Organism:Homo sapiens (Human)
Description:Glutamate-Kainate 7 0 HUMAN::Q13003
Residue:919
BDBM50364074
NameBDBM50364074
Synonyms:CHEMBL1950805
TypeSmall organic molecule
Emp. Form.C21H17IN2O5
Mol. Mass.504.2746
SMILESOC(=O)[C@H]1NCCN([C@H]1C(O)=O)C(=O)c1ccc2cc(I)c3ccccc3c2c1