Reaction Details
TargetGlutamate receptor ionotropic, NMDA 1/2A
LigandBDBM50419775
Substrate/Competitorn/a
Meas. Tech.ChEMBL_802333 (CHEMBL1954477)
Ki 210±n/a nM
Citation Irvine, MWCosta, BMDlaboga, DCulley, GRHulse, RScholefield, CLAtlason, PFang, GEaves, RMorley, RMayo-Martin, MBAmici, MBortolotto, ZADonaldson, LCollingridge, GLMolnár, EMonaghan, DTJane, DE Piperazine-2,3-dicarboxylic acid derivatives as dual antagonists of NMDA and GluK1-containing kainate receptors. J Med Chem55:327-41 (2012) 
 
Glutamate receptor ionotropic, NMDA 1/2A
Name:Glutamate receptor ionotropic, NMDA 1/2A
Type:n/a
Mol. Mass.:n/a
Description:ASSAY_ID of EBI is 141020
Components:This complex has 2 components.
Component 1
Name:Glutamate receptor ionotropic, NMDA 2A
Synonyms:Glutamate NMDA receptor; Grin1/Grin2a Grin2a NMDE1_RAT
Type:Protein
Mol. Mass.:165478.25
Organism:Rattus norvegicus (Rat)
Description:Q00959
Residue:1464
Component 2
Name:Glutamate receptor ionotropic, NMDA 1
Synonyms:Glutamate (NMDA) receptor subunit zeta 1 Glutamate-NMDA-Channel Glutamate-NMDA-Polyamine NMDA Nmdar1 | phencyclidine
Type:Enzyme Catalytic Domain
Mol. Mass.:105533.40
Organism:RAT
Description:P35439
Residue:938
BDBM50419775
NameBDBM50419775
Synonyms:CHEMBL1950808
TypeSmall organic molecule
Emp. Form.C21H18N2O5
Mol. Mass.378.378
SMILESOC(=O)[C@@H]1NCCN([C@@H]1C(O)=O)C(=O)c1ccc2c(ccc3ccccc23)c1