Reaction Details
TargetCannabinoid receptor 2
LigandBDBM50364234
Substrate/Competitorn/a
Meas. Tech.ChEMBL_804228 (CHEMBL1954242)
Ki 490±n/a nM
Citation Roughley, SDBrowne, HMacias, ATBenwell, KBrooks, TD'Alessandro, JDaniels, ZDugdale, SFrancis, GGibbons, BHart, THaymes, TKennett, GLightowler, SMatassova, NMansell, HMerrett, AMisra, APadfield, AParsons, RPratt, RRobertson, ASimmonite, HTan, KWalls, SBWong, M Fatty acid amide hydrolase inhibitors. 3: tetra-substituted azetidine ureas with in vivo activity. Bioorg Med Chem Lett22:901-6 (2012) 
 
Cannabinoid receptor 2
Name:Cannabinoid receptor 2
Type:G Protein-Coupled Receptor (GPCR)
Mol. Mass.:39690.94
Organism:Homo sapiens (Human)
Description:P34972
Residue:360
BDBM50364234
NameBDBM50364234
Synonyms:CHEMBL1952279
TypeSmall organic molecule
Emp. Form.C24H23Cl2N3O2
Mol. Mass.456.364
SMILESCN(Cc1ccccc1)C(=O)N1CC(C1)O[C@H](c1ccc(Cl)cc1)c1cccnc1Cl