Reaction Details
TargetFatty-acid amide hydrolase 1
LigandBDBM50364251
Substrate/Competitorn/a
Meas. Tech.ChEMBL_804223 (CHEMBL1954237)
IC50 39700±n/a nM
Citation Roughley, SDBrowne, HMacias, ATBenwell, KBrooks, TD'Alessandro, JDaniels, ZDugdale, SFrancis, GGibbons, BHart, THaymes, TKennett, GLightowler, SMatassova, NMansell, HMerrett, AMisra, APadfield, AParsons, RPratt, RRobertson, ASimmonite, HTan, KWalls, SBWong, M Fatty acid amide hydrolase inhibitors. 3: tetra-substituted azetidine ureas with in vivo activity. Bioorg Med Chem Lett22:901-6 (2012) 
 
Fatty-acid amide hydrolase 1
Name:Fatty-acid amide hydrolase 1
Type:Protein
Mol. Mass.:63071.19
Organism:Homo sapiens (Human)
Description:O00519
Residue:579
BDBM50364251
NameBDBM50364251
Synonyms:CHEMBL1952083
TypeSmall organic molecule
Emp. Form.C21H24ClN3O3
Mol. Mass.401.887
SMILESClc1ccc(cc1)C(OC1CN(C1)C(=O)N1CCCCC1)c1ccc[nH]c1=O