Reaction Details
TargetFatty-acid amide hydrolase 1
LigandBDBM50364275
Substrate/Competitorn/a
Meas. Tech.ChEMBL_804223 (CHEMBL1954237)
IC50>500000±n/a nM
Citation Roughley, SDBrowne, HMacias, ATBenwell, KBrooks, TD'Alessandro, JDaniels, ZDugdale, SFrancis, GGibbons, BHart, THaymes, TKennett, GLightowler, SMatassova, NMansell, HMerrett, AMisra, APadfield, AParsons, RPratt, RRobertson, ASimmonite, HTan, KWalls, SBWong, M Fatty acid amide hydrolase inhibitors. 3: tetra-substituted azetidine ureas with in vivo activity. Bioorg Med Chem Lett22:901-6 (2012) 
 
Fatty-acid amide hydrolase 1
Name:Fatty-acid amide hydrolase 1
Type:Protein
Mol. Mass.:63071.19
Organism:Homo sapiens (Human)
Description:O00519
Residue:579
BDBM50364275
NameBDBM50364275
Synonyms:CHEMBL1952273
TypeSmall organic molecule
Emp. Form.C20H23Cl2N3O2
Mol. Mass.408.322
SMILESCC(C)(C)NC(=O)N1CC(C1)OC(c1ccc(Cl)cc1)c1cccnc1Cl