Reaction Details
TargetFatty-acid amide hydrolase 1
LigandBDBM50296484
Substrate/Competitorn/a
Meas. Tech.ChEMBL_804223 (CHEMBL1954237)
IC50 973±n/a nM
Citation Roughley, SDBrowne, HMacias, ATBenwell, KBrooks, TD'Alessandro, JDaniels, ZDugdale, SFrancis, GGibbons, BHart, THaymes, TKennett, GLightowler, SMatassova, NMansell, HMerrett, AMisra, APadfield, AParsons, RPratt, RRobertson, ASimmonite, HTan, KWalls, SBWong, M Fatty acid amide hydrolase inhibitors. 3: tetra-substituted azetidine ureas with in vivo activity. Bioorg Med Chem Lett22:901-6 (2012) 
 
Fatty-acid amide hydrolase 1
Name:Fatty-acid amide hydrolase 1
Type:Protein
Mol. Mass.:63071.19
Organism:Homo sapiens (Human)
Description:O00519
Residue:579
BDBM50296484
NameBDBM50296484
Synonyms:(S)-{3-[(4-Chlorophenyl)-(2-chloropyridin-3-yl)methoxy]azetidin-1-yl}piperidin-1-ylmethanone VER-156084
TypeSmall organic molecule
Emp. Form.C21H23Cl2N3O2
Mol. Mass.420.332
SMILESClc1ccc(cc1)[C@H](OC1CN(C1)C(=O)N1CCCCC1)c1cccnc1Cl