Reaction Details
TargetFatty-acid amide hydrolase 1 [30-579]
LigandBDBM50364238
Substrate/Competitorn/a
Meas. Tech.ChEMBL_804224 (CHEMBL1954238)
IC50 464±n/a nM
Citation Roughley, SDBrowne, HMacias, ATBenwell, KBrooks, TD'Alessandro, JDaniels, ZDugdale, SFrancis, GGibbons, BHart, THaymes, TKennett, GLightowler, SMatassova, NMansell, HMerrett, AMisra, APadfield, AParsons, RPratt, RRobertson, ASimmonite, HTan, KWalls, SBWong, M Fatty acid amide hydrolase inhibitors. 3: tetra-substituted azetidine ureas with in vivo activity. Bioorg Med Chem Lett22:901-6 (2012) 
 
Fatty-acid amide hydrolase 1 [30-579]
Name:Fatty-acid amide hydrolase 1 [30-579]
Type:Single-pass membrane protein; homodimer
Mol. Mass.:60474.00
Organism:Rattus norvegicus (rat)
Description:P97612 (aa 30-579)
Residue:550
BDBM50364238
NameBDBM50364238
Synonyms:CHEMBL1952070
TypeSmall organic molecule
Emp. Form.C21H23ClFN3O2
Mol. Mass.403.878
SMILESFc1ccc(cc1)C(OC1CN(C1)C(=O)N1CCCCC1)c1cccnc1Cl