Reaction Details
TargetEndothelial lipase
LigandBDBM50364292
Substrate/Competitorn/a
Meas. Tech.ChEMBL_804415 (CHEMBL1954842)
IC50 2500±n/a nM
Citation O'Connell, DPLeBlanc, DFCromley, DBillheimer, JRader, DJBachovchin, WW Design and synthesis of boronic acid inhibitors of endothelial lipase. Bioorg Med Chem Lett22:1397-401 (2012) 
 
Endothelial lipase
Name:Endothelial lipase
Type:Protein
Mol. Mass.:56805.62
Organism:Homo sapiens (Human)
Description:Q9Y5X9
Residue:500
BDBM50364292
NameBDBM50364292
Synonyms:CHEMBL1949700
TypeSmall organic molecule
Emp. Form.C21H35BO2
Mol. Mass.330.312
SMILESCCCCCCCCCc1ccc(cc1)B1OC(C)(C)C(C)(C)O1