Reaction Details
TargetLipoprotein lipase
LigandBDBM50364282
Substrate/Competitorn/a
Meas. Tech.ChEMBL_804416 (CHEMBL1954843)
IC50 8000±n/a nM
Citation O'Connell, DPLeBlanc, DFCromley, DBillheimer, JRader, DJBachovchin, WW Design and synthesis of boronic acid inhibitors of endothelial lipase. Bioorg Med Chem Lett22:1397-401 (2012) 
 
Lipoprotein lipase
Name:Lipoprotein lipase
Type:PROTEIN
Mol. Mass.:53173.96
Organism:Homo sapiens (Human)
Description:ChEMBL_1280894
Residue:475
BDBM50364282
NameBDBM50364282
Synonyms:CHEMBL1952295
TypeSmall organic molecule
Emp. Form.C9H13BO2
Mol. Mass.164.009
SMILESCCCc1ccc(cc1)B(O)O