Reaction Details
TargetLipoprotein lipase
LigandBDBM50364295
Substrate/Competitorn/a
Meas. Tech.ChEMBL_804416 (CHEMBL1954843)
IC50 4400±n/a nM
Citation O'Connell, DPLeBlanc, DFCromley, DBillheimer, JRader, DJBachovchin, WW Design and synthesis of boronic acid inhibitors of endothelial lipase. Bioorg Med Chem Lett22:1397-401 (2012) 
 
Lipoprotein lipase
Name:Lipoprotein lipase
Type:PROTEIN
Mol. Mass.:53173.96
Organism:Homo sapiens (Human)
Description:ChEMBL_1280894
Residue:475
BDBM50364295
NameBDBM50364295
Synonyms:CHEMBL1952307
TypeSmall organic molecule
Emp. Form.C18H21BO2
Mol. Mass.280.169
SMILESCC1(C)OB(OC1(C)C)c1ccc(cc1)-c1ccccc1