Reaction Details
TargetLipoprotein lipase
LigandBDBM50364297
Substrate/Competitorn/a
Meas. Tech.ChEMBL_804416 (CHEMBL1954843)
IC50 9600±n/a nM
Citation O'Connell, DPLeBlanc, DFCromley, DBillheimer, JRader, DJBachovchin, WW Design and synthesis of boronic acid inhibitors of endothelial lipase. Bioorg Med Chem Lett22:1397-401 (2012) 
 
Lipoprotein lipase
Name:Lipoprotein lipase
Type:PROTEIN
Mol. Mass.:53173.96
Organism:Homo sapiens (Human)
Description:ChEMBL_1280894
Residue:475
BDBM50364297
NameBDBM50364297
Synonyms:CHEMBL1952309
TypeSmall organic molecule
Emp. Form.C16H19BO3
Mol. Mass.270.131
SMILESCC1(C)OB(OC1(C)C)c1ccc(cc1)-c1ccco1