Reaction Details
TargetEndothelial lipase
LigandBDBM50364300
Substrate/Competitorn/a
Meas. Tech.ChEMBL_804418 (CHEMBL1954845)
IC50 3100±n/a nM
Citation O'Connell, DPLeBlanc, DFCromley, DBillheimer, JRader, DJBachovchin, WW Design and synthesis of boronic acid inhibitors of endothelial lipase. Bioorg Med Chem Lett22:1397-401 (2012) 
 
Endothelial lipase
Name:Endothelial lipase
Type:Protein
Mol. Mass.:56805.62
Organism:Homo sapiens (Human)
Description:Q9Y5X9
Residue:500
BDBM50364300
NameBDBM50364300
Synonyms:CHEMBL1952312
TypeSmall organic molecule
Emp. Form.C16H19BO2S
Mol. Mass.286.197
SMILESCC1(C)OB(OC1(C)C)c1ccc(cc1)-c1ccsc1