Reaction Details
TargetLipoprotein lipase
LigandBDBM50364290
Substrate/Competitorn/a
Meas. Tech.ChEMBL_804419 (CHEMBL1954846)
IC50 21000±n/a nM
Citation O'Connell, DPLeBlanc, DFCromley, DBillheimer, JRader, DJBachovchin, WW Design and synthesis of boronic acid inhibitors of endothelial lipase. Bioorg Med Chem Lett22:1397-401 (2012) 
 
Lipoprotein lipase
Name:Lipoprotein lipase
Type:PROTEIN
Mol. Mass.:53173.96
Organism:Homo sapiens (Human)
Description:ChEMBL_1280894
Residue:475
BDBM50364290
NameBDBM50364290
Synonyms:CHEMBL1952303
TypeSmall organic molecule
Emp. Form.C17H27BO2
Mol. Mass.274.206
SMILESCCCCCc1ccc(cc1)B1OC(C)(C)C(C)(C)O1