Reaction Details
TargetEndothelial lipase
LigandBDBM50067895
Substrate/Competitorn/a
Meas. Tech.ChEMBL_804418 (CHEMBL1954845)
IC50 22000±n/a nM
Citation O'Connell, DPLeBlanc, DFCromley, DBillheimer, JRader, DJBachovchin, WW Design and synthesis of boronic acid inhibitors of endothelial lipase. Bioorg Med Chem Lett22:1397-401 (2012) 
 
Endothelial lipase
Name:Endothelial lipase
Type:Protein
Mol. Mass.:56805.62
Organism:Homo sapiens (Human)
Description:Q9Y5X9
Residue:500
BDBM50067895
NameBDBM50067895
Synonyms:CHEMBL140780 p-tolylboronic acid
TypeSmall organic molecule
Emp. Form.C7H9BO2
Mol. Mass.135.956
SMILESCc1ccc(cc1)B(O)O