Reaction Details
TargetLegumain
LigandBDBM50364367
Substrate/Competitorn/a
Meas. Tech.ChEMBL_805028 (CHEMBL1952889)
IC50 4.4±n/a nM
Citation Lee, JBogyo, M Synthesis and evaluation of aza-peptidyl inhibitors of the lysosomal asparaginyl endopeptidase, legumain. Bioorg Med Chem Lett22:1340-3 (2012) 
 
Legumain
Name:Legumain
Type:PROTEIN
Mol. Mass.:49370.42
Organism:Mus musculus
Description:n/a
Residue:435
BDBM50364367
NameBDBM50364367
Synonyms:CHEMBL1950283
TypeSmall organic molecule
Emp. Form.C19H27N5O8
Mol. Mass.453.4464
SMILESCCOC(=O)C1OC1C(=O)N(CC(N)=O)NC(=O)[C@@H]1CCCN1C(=O)C1(CC1)NC(C)=O