Reaction Details
TargetTransient receptor potential cation channel subfamily A member 1
LigandBDBM50275147
Substrate/Competitorn/a
Meas. Tech.ChEMBL_802415 (CHEMBL1954858)
IC50>100000±n/a nM
Citation Morera, EDe Petrocellis, LMorera, LMoriello, ASNalli, MDi Marzo, VOrtar, G Synthesis and biological evaluation of [6]-gingerol analogues as transient receptor potential channel TRPV1 and TRPA1 modulators. Bioorg Med Chem Lett22:1674-7 (2012) 
 
Transient receptor potential cation channel subfamily A member 1
Name:Transient receptor potential cation channel subfamily A member 1
Type:PROTEIN
Mol. Mass.:128622.74
Organism:Rattus norvegicus
Description:ChEMBL_1450487
Residue:1125
BDBM50275147
NameBDBM50275147
Synonyms:6-Gingerol CHEMBL446043 [6]-gingerol
TypeSmall organic molecule
Emp. Form.C17H26O4
Mol. Mass.294.3859
SMILESCCCCC[C@H](O)CC(=O)CCc1ccc(O)c(OC)c1