Reaction Details
TargetProstaglandin D2 receptor 2
LigandBDBM50364536
Substrate/Competitorn/a
Meas. Tech.ChEMBL_802810 (CHEMBL1953544)
IC50 8±n/a nM
Citation Liu, JJWang, YJohnson, MGLi, ARShen, WWang, XSu, YBrown, MVan Lengerich, BRickel, EMartin, TBudelsky, ASeitz, LDanao, JTang, HLCollins, TMedina, JC Optimization of phenylacetic acid derivatives for balanced CRTH2 and DP dual antagonists. Bioorg Med Chem Lett22:1686-9 (2012) 
 
Prostaglandin D2 receptor 2
Name:Prostaglandin D2 receptor 2
Type:Enzyme
Mol. Mass.:43295.45
Organism:Homo sapiens (Human)
Description:Q9Y5Y4
Residue:395
BDBM50364536
NameBDBM50364536
Synonyms:CHEMBL1950879
TypeSmall organic molecule
Emp. Form.C27H25Cl2N3O6S
Mol. Mass.590.475
SMILESCCCc1cc(n[nH]1)-c1ccc(Oc2ccc(CC(O)=O)cc2OC)c(NS(=O)(=O)c2ccc(Cl)cc2Cl)c1