Reaction Details
TargetCytochrome P450 2C19
LigandBDBM50364957
Substrate/Competitorn/a
Meas. Tech.ChEMBL_804469 (CHEMBL1952479)
IC50>30000±n/a nM
Citation Hudkins, RLZulli, ALDandu, RrTao, MJosef, KAAimone, LDHaltiwanger, RCHuang, ZLyons, JAMathiasen, JRRaddatz, RGruner, JA 4-phenoxypiperidine pyridazin-3-one histamine H(3) receptor inverse agonists demonstrating potent and robust wake promoting activity. Bioorg Med Chem Lett22:1504-9 (2012) 
 
Cytochrome P450 2C19
Name:Cytochrome P450 2C19
Type:Enzyme
Mol. Mass.:55935.47
Organism:Homo sapiens (Human)
Description:P33261
Residue:490
BDBM50364957
NameBDBM50364957
Synonyms:CHEMBL1950643
TypeSmall organic molecule
Emp. Form.C19H23N3O2
Mol. Mass.325.4048
SMILESO=c1ccc(n[nH]1)-c1ccc(OC2CCN(CC2)C2CCC2)cc1