Reaction Details
Target5-hydroxytryptamine receptor 6
LigandBDBM50364981
Substrate/Competitorn/a
Meas. Tech.ChEMBL_804508 (CHEMBL1952518)
Ki 0.360±n/a nM
Citation Henderson, AJGuzzo, PRGhosh, AKaur, JKoo, JMNacro, KPanduga, SPathak, RShimpukade, BTan, VXiang, KWierschke, JDIsherwood, ML Epiminocyclohepta[b]indole analogs as 5-HT6 antagonists. Bioorg Med Chem Lett22:1494-8 (2012) 
 
5-hydroxytryptamine receptor 6
Name:5-hydroxytryptamine receptor 6
Type:G Protein-Coupled Receptor (GPCR)
Mol. Mass.:46968.43
Organism:Homo sapiens (Human)
Description:P50406
Residue:440
BDBM50364981
NameBDBM50364981
Synonyms:CHEMBL1950776
TypeSmall organic molecule
Emp. Form.C22H20N2O2S2
Mol. Mass.408.536
SMILESCn1c2CC3CCC(N3)c2c2cc(ccc12)S(=O)(=O)c1csc2ccccc12