Reaction Details
TargetcAMP-specific 3',5'-cyclic phosphodiesterase 4B
LigandBDBM50365055
Substrate/Competitorn/a
Meas. Tech.ChEMBL_804873 (CHEMBL1953791)
IC50 520±n/a nM
Citation Shan, WJHuang, LZhou, QJiang, HLLuo, ZHLai, KFLi, XS Dualß2-adrenoceptor agonists-PDE4 inhibitors for the treatment of asthma and COPD. Bioorg Med Chem Lett22:1523-6 (2012) 
 
cAMP-specific 3',5'-cyclic phosphodiesterase 4B
Name:cAMP-specific 3',5'-cyclic phosphodiesterase 4B
Type:Protein
Mol. Mass.:83318.87
Organism:Homo sapiens (Human)
Description:Q07343
Residue:736
BDBM50365055
NameBDBM50365055
Synonyms:CHEMBL82318
TypeSmall organic molecule
Emp. Form.C16H20N2O3
Mol. Mass.288.3416
SMILESCOc1ccc(cc1OC)C1=NNC(=O)C2CCCCC12