Reaction Details
TargetDelta-type opioid receptor
LigandBDBM50365109
Substrate/Competitorn/a
Meas. Tech.ChEMBL_805243 (CHEMBL1955136)
Ki 5800±n/a nM
Citation Iyer, MRLee, YSDeschamps, JRDersch, CMRothman, RBJacobson, AERice, KC Probes for narcotic receptor mediated phenomena. 44. Synthesis of an N-substituted 4-hydroxy-5-(3-hydroxyphenyl)morphan with high affinity and selectiveµ-antagonist activity. Eur J Med Chem50:44-54 (2012) 
 
Delta-type opioid receptor
Name:Delta-type opioid receptor
Type:G Protein-Coupled Receptor (GPCR)
Mol. Mass.:40382.98
Organism:Homo sapiens (Human)
Description:Competition binding assays were carried out using membrane preparations from transfected HN9.10 cells that constitutively expressed the delta opioid receptor.
Residue:372
BDBM50365109
NameBDBM50365109
Synonyms:CHEMBL1951701
TypeSmall organic molecule
Emp. Form.C22H27NO2
Mol. Mass.337.4553
SMILESO[C@H]1CN(CCc2ccccc2)[C@H]2CCC[C@@]1(C2)c1cccc(O)c1