Reaction Details
TargetGlycogen synthase kinase-3 beta
LigandBDBM32362
Substrate/Competitorn/a
Meas. Tech.ChEMBL_806404 (CHEMBL1959333)
IC50>32000±n/a nM
Citation Conway, JGMcDonald, BParham, JKeith, BRusnak, DWShaw, EJansen, MLin, PPayne, ACrosby, RMJohnson, JHFrick, LLin, MHDepee, STadepalli, SVotta, BJames, IFuller, KChambers, TJKull, FCChamberlain, SDHutchins, JT Inhibition of colony-stimulating-factor-1 signaling in vivo with the orally bioavailable cFMS kinase inhibitor GW2580. Proc Natl Acad Sci U S A102:16078-83 (2005) 
 
Glycogen synthase kinase-3 beta
Name:Glycogen synthase kinase-3 beta
Type:Enzyme
Mol. Mass.:46756.38
Organism:Homo sapiens (Human)
Description:P49841
Residue:420
BDBM32362
NameBDBM32362
Synonyms:5-[[3-methoxy-4-[(4-methoxyphenyl)methoxy]phenyl]methyl]pyrimidine-2,4-diamine [2-amino-5-(3-methoxy-4-p-anisyloxy-benzyl)pyrimidin-4-yl]amine | cid_11617559
TypeSmall organic molecule
Emp. Form.C20H22N4O3
Mol. Mass.366.4137
SMILESCOc1ccc(COc2ccc(Cc3cnc(N)nc3N)cc2OC)cc1