Reaction Details
TargetPlatelet-derived growth factor receptor beta
LigandBDBM32362
Substrate/Competitorn/a
Meas. Tech.ChEMBL_806411 (CHEMBL1959340)
IC50>10000±n/a nM
Citation Conway, JGMcDonald, BParham, JKeith, BRusnak, DWShaw, EJansen, MLin, PPayne, ACrosby, RMJohnson, JHFrick, LLin, MHDepee, STadepalli, SVotta, BJames, IFuller, KChambers, TJKull, FCChamberlain, SDHutchins, JT Inhibition of colony-stimulating-factor-1 signaling in vivo with the orally bioavailable cFMS kinase inhibitor GW2580. Proc Natl Acad Sci U S A102:16078-83 (2005) 
 
Platelet-derived growth factor receptor beta
Name:Platelet-derived growth factor receptor beta
Type:Enzyme
Mol. Mass.:123922.25
Organism:Homo sapiens (Human)
Description:P09619
Residue:1106
BDBM32362
NameBDBM32362
Synonyms:5-[[3-methoxy-4-[(4-methoxyphenyl)methoxy]phenyl]methyl]pyrimidine-2,4-diamine [2-amino-5-(3-methoxy-4-p-anisyloxy-benzyl)pyrimidin-4-yl]amine | cid_11617559
TypeSmall organic molecule
Emp. Form.C20H22N4O3
Mol. Mass.366.4137
SMILESCOc1ccc(COc2ccc(Cc3cnc(N)nc3N)cc2OC)cc1