Reaction Details
Target[Pyruvate dehydrogenase (acetyl-transferring)] kinase isozyme 4, mitochondrial
LigandBDBM32362
Substrate/Competitorn/a
Meas. Tech.ChEMBL_806412 (CHEMBL1959341)
IC50>28000±n/a nM
Citation Conway, JGMcDonald, BParham, JKeith, BRusnak, DWShaw, EJansen, MLin, PPayne, ACrosby, RMJohnson, JHFrick, LLin, MHDepee, STadepalli, SVotta, BJames, IFuller, KChambers, TJKull, FCChamberlain, SDHutchins, JT Inhibition of colony-stimulating-factor-1 signaling in vivo with the orally bioavailable cFMS kinase inhibitor GW2580. Proc Natl Acad Sci U S A102:16078-83 (2005) 
 
[Pyruvate dehydrogenase (acetyl-transferring)] kinase isozyme 4, mitochondrial
Name:[Pyruvate dehydrogenase (acetyl-transferring)] kinase isozyme 4, mitochondrial
Type:Enzyme
Mol. Mass.:46469.71
Organism:Homo sapiens (Human)
Description:Q16654
Residue:411
BDBM32362
NameBDBM32362
Synonyms:5-[[3-methoxy-4-[(4-methoxyphenyl)methoxy]phenyl]methyl]pyrimidine-2,4-diamine [2-amino-5-(3-methoxy-4-p-anisyloxy-benzyl)pyrimidin-4-yl]amine | cid_11617559
TypeSmall organic molecule
Emp. Form.C20H22N4O3
Mol. Mass.366.4137
SMILESCOc1ccc(COc2ccc(Cc3cnc(N)nc3N)cc2OC)cc1