Reaction Details
TargetAcetyl-CoA carboxylase 1
LigandBDBM50365276
Substrate/Competitorn/a
Meas. Tech.ChEMBL_806322 (CHEMBL1959086)
IC50 15±n/a nM
Citation Freeman-Cook, KDAmor, PBader, SBuzon, LMCoffey, SBCorbett, JWDirico, KJDoran, SDElliott, RLEsler, WGuzman-Perez, AHenegar, KEHouser, JAJones, CSLimberakis, CLoomis, KMcPherson, KMurdande, SNelson, KLPhillion, DPierce, BSSong, WSugarman, ETapley, STu, MZhao, Z Maximizing lipophilic efficiency: the use of Free-Wilson analysis in the design of inhibitors of acetyl-CoA carboxylase. J Med Chem55:935-42 (2012) 
 
Acetyl-CoA carboxylase 1
Name:Acetyl-CoA carboxylase 1
Type:Protein
Mol. Mass.:265183.92
Organism:Rattus norvegicus (Rat)
Description:P11497
Residue:2345
BDBM50365276
NameBDBM50365276
Synonyms:CHEMBL1958358
TypeSmall organic molecule
Emp. Form.C23H25N5O3
Mol. Mass.419.4763
SMILESCc1cc(cc2cn[nH]c12)C(=O)N1CCC2(CC1)CC(=O)c1nn(cc1O2)C1CCC1