Reaction Details
TargetAcetyl-CoA carboxylase 1
LigandBDBM50365287
Substrate/Competitorn/a
Meas. Tech.ChEMBL_806322 (CHEMBL1959086)
IC50 9.1±n/a nM
Citation Freeman-Cook, KDAmor, PBader, SBuzon, LMCoffey, SBCorbett, JWDirico, KJDoran, SDElliott, RLEsler, WGuzman-Perez, AHenegar, KEHouser, JAJones, CSLimberakis, CLoomis, KMcPherson, KMurdande, SNelson, KLPhillion, DPierce, BSSong, WSugarman, ETapley, STu, MZhao, Z Maximizing lipophilic efficiency: the use of Free-Wilson analysis in the design of inhibitors of acetyl-CoA carboxylase. J Med Chem55:935-42 (2012) 
 
Acetyl-CoA carboxylase 1
Name:Acetyl-CoA carboxylase 1
Type:Protein
Mol. Mass.:265183.92
Organism:Rattus norvegicus (Rat)
Description:P11497
Residue:2345
BDBM50365287
NameBDBM50365287
Synonyms:CHEMBL1958368
TypeSmall organic molecule
Emp. Form.C24H28N4O3
Mol. Mass.420.5041
SMILESCCn1nc2c(OC3(CCN(CC3)C(=O)c3cc(C)c4[nH]cc(C)c4c3)CC2=O)c1C