Reaction Details
TargetAcetyl-CoA carboxylase 1
LigandBDBM50365293
Substrate/Competitorn/a
Meas. Tech.ChEMBL_806322 (CHEMBL1959086)
IC50 10±n/a nM
Citation Freeman-Cook, KDAmor, PBader, SBuzon, LMCoffey, SBCorbett, JWDirico, KJDoran, SDElliott, RLEsler, WGuzman-Perez, AHenegar, KEHouser, JAJones, CSLimberakis, CLoomis, KMcPherson, KMurdande, SNelson, KLPhillion, DPierce, BSSong, WSugarman, ETapley, STu, MZhao, Z Maximizing lipophilic efficiency: the use of Free-Wilson analysis in the design of inhibitors of acetyl-CoA carboxylase. J Med Chem55:935-42 (2012) 
 
Acetyl-CoA carboxylase 1
Name:Acetyl-CoA carboxylase 1
Type:Protein
Mol. Mass.:265183.92
Organism:Rattus norvegicus (Rat)
Description:P11497
Residue:2345
BDBM50365293
NameBDBM50365293
Synonyms:CHEMBL1958374
TypeSmall organic molecule
Emp. Form.C24H29N5O3
Mol. Mass.435.5188
SMILESCc1nc2c(C)cc(cc2[nH]1)C(=O)N1CCC2(CC1)CC(=O)c1nn(cc1O2)C(C)(C)C