Reaction Details
TargetMast/stem cell growth factor receptor Kit
LigandBDBM50355489
Substrate/Competitorn/a
Meas. Tech.ChEMBL_806855 (CHEMBL1958983)
IC50 4±n/a nM
Citation Heidary, DKHuang, GBoucher, DMa, JForster, CGrey, RXu, JArnost, MChoquette, DChen, GZhou, JHYao, YMBall, EDNamchuk, MDavies, RJHenkel, G VX-322: a novel dual receptor tyrosine kinase inhibitor for the treatment of acute myelogenous leukemia. J Med Chem55:725-34 (2012) 
 
Mast/stem cell growth factor receptor Kit
Name:Mast/stem cell growth factor receptor Kit
Type:Protein
Mol. Mass.:109869.37
Organism:Homo sapiens (Human)
Description:P10721
Residue:976
BDBM50355489
NameBDBM50355489
Synonyms:CHEMBL1835867
TypeSmall organic molecule
Emp. Form.C19H23N7
Mol. Mass.349.4328
SMILESCN1CCC(CC1)c1ccc(Nc2nc(N)n(n2)-c2ccccn2)cc1