Reaction Details
TargetGlycogen synthase kinase-3 beta
LigandBDBM50026834
Substrate/Competitorn/a
Meas. Tech.ChEMBL_807300 (CHEMBL1960393)
IC50 32±n/a nM
Citation Gentile, GMerlo, GPozzan, ABernasconi, GBax, BBamborough, PBridges, ACarter, PNeu, MYao, GBrough, CCutler, GCoffin, ABelyanskaya, S 5-Aryl-4-carboxamide-1,3-oxazoles: potent and selective GSK-3 inhibitors. Bioorg Med Chem Lett22:1989-94 (2012) 
 
Glycogen synthase kinase-3 beta
Name:Glycogen synthase kinase-3 beta
Type:Enzyme
Mol. Mass.:46756.38
Organism:Homo sapiens (Human)
Description:P49841
Residue:420
BDBM50026834
NameBDBM50026834
Synonyms:CHEMBL1957226
TypeSmall organic molecule
Emp. Form.C18H16ClN3O4
Mol. Mass.373.79
SMILESCOc1cc(CNC(=O)c2ncoc2-c2ccc(OC)c(Cl)c2)ccn1