Reaction Details
TargetGlycogen synthase kinase-3 beta
LigandBDBM50026867
Substrate/Competitorn/a
Meas. Tech.ChEMBL_807300 (CHEMBL1960393)
IC50 13±n/a nM
Citation Gentile, GMerlo, GPozzan, ABernasconi, GBax, BBamborough, PBridges, ACarter, PNeu, MYao, GBrough, CCutler, GCoffin, ABelyanskaya, S 5-Aryl-4-carboxamide-1,3-oxazoles: potent and selective GSK-3 inhibitors. Bioorg Med Chem Lett22:1989-94 (2012) 
 
Glycogen synthase kinase-3 beta
Name:Glycogen synthase kinase-3 beta
Type:Enzyme
Mol. Mass.:46756.38
Organism:Homo sapiens (Human)
Description:P49841
Residue:420
BDBM50026867
NameBDBM50026867
Synonyms:CHEMBL1957091
TypeSmall organic molecule
Emp. Form.C17H14ClN3O3
Mol. Mass.343.764
SMILESCOc1ccc(cc1Cl)-c1ocnc1C(=O)NCc1ccncc1