Reaction Details
TargetGlycogen synthase kinase-3 beta
LigandBDBM50026854
Substrate/Competitorn/a
Meas. Tech.ChEMBL_807300 (CHEMBL1960393)
IC50 3162±n/a nM
Citation Gentile, GMerlo, GPozzan, ABernasconi, GBax, BBamborough, PBridges, ACarter, PNeu, MYao, GBrough, CCutler, GCoffin, ABelyanskaya, S 5-Aryl-4-carboxamide-1,3-oxazoles: potent and selective GSK-3 inhibitors. Bioorg Med Chem Lett22:1989-94 (2012) 
 
Glycogen synthase kinase-3 beta
Name:Glycogen synthase kinase-3 beta
Type:Enzyme
Mol. Mass.:46756.38
Organism:Homo sapiens (Human)
Description:P49841
Residue:420
BDBM50026854
NameBDBM50026854
Synonyms:CHEMBL1957094
TypeSmall organic molecule
Emp. Form.C18H17N3O3
Mol. Mass.323.3459
SMILESCOc1ccc(-c2ocnc2C(=O)NCc2ccncc2)c(C)c1