Reaction Details
TargetGlycogen synthase kinase-3 beta
LigandBDBM50026861
Substrate/Competitorn/a
Meas. Tech.ChEMBL_807301 (CHEMBL1960394)
IC50 1995±n/a nM
Citation Gentile, GMerlo, GPozzan, ABernasconi, GBax, BBamborough, PBridges, ACarter, PNeu, MYao, GBrough, CCutler, GCoffin, ABelyanskaya, S 5-Aryl-4-carboxamide-1,3-oxazoles: potent and selective GSK-3 inhibitors. Bioorg Med Chem Lett22:1989-94 (2012) 
 
Glycogen synthase kinase-3 beta
Name:Glycogen synthase kinase-3 beta
Type:Enzyme
Mol. Mass.:46756.38
Organism:Homo sapiens (Human)
Description:P49841
Residue:420
BDBM50026861
NameBDBM50026861
Synonyms:CHEMBL1957098
TypeSmall organic molecule
Emp. Form.C16H14N4O3
Mol. Mass.310.3074
SMILESCOc1ccc(cn1)-c1ocnc1C(=O)NCc1ccncc1